Target
Kallikrein-1
Ligand
BDBM50172726
Substrate
Meas. Tech.
ChEMBL_1578582 (CHEMBL3811623)
Ki
4±n/a nM
Citation
 Glunz, PWMueller, LCheney, DLLadziata, VZou, YWurtz, NRWei, AWong, PCWexler, RRPriestley, ES Atropisomer Control in Macrocyclic Factor VIIa Inhibitors. J Med Chem 59:4007-18 (2016)  
Target
Name:
Kallikrein-1
Synonyms:
KLK1 Kallikrein 1 Kidney/pancreas/salivary gland kallikrein | Tissue kallikrein
Type:
Enzyme
Mol. Mass.:
28874.69
Organism:
Homo sapiens (Human)
Description:
P06870
Residue:
262
  
Inhibitor
Name:
BDBM50172726
Synonyms:
CHEMBL3809352
Type:
Small organic molecule
Emp. Form.:
C28H27N5O3
Mol. Mass.:
481.5457
SMILES:
C[C@@H]1COC(=O)Nc2cccc(CNC(=O)C(Nc3ccc4c(N)nccc4c3)c3ccc1cc3)c2
: