Target
Alpha-1A adrenergic receptor
Ligand
BDBM50173004
Substrate
Meas. Tech.
ChEMBL_1579180 (CHEMBL3812083)
IC50
2.9±n/a nM
Citation
 Zhao, FLi, JChen, YTian, YWu, CXie, YZhou, YWang, JXie, XLiu, H Design, Synthesis, and Biological Evaluation of Indoline and Indole Derivatives as Potent and Selectivea1A-Adrenoceptor Antagonists. J Med Chem 59:3826-39 (2016)  
Target
Name:
Alpha-1A adrenergic receptor
Synonyms:
ADA1A_HUMAN ADRA1C Alpha 1A-adrenoceptor Alpha adrenergic receptor 1a Alpha-adrenergic receptor 1c adrenergic Alpha1 | adrenergic Alpha1C
Type:
Cell-surface receptors
Mol. Mass.:
51511.67
Organism:
Homo sapiens (Human)
Description:
P35348
Residue:
466
  
Inhibitor
Name:
BDBM50173004
Synonyms:
CHEMBL3808896
Type:
Small organic molecule
Emp. Form.:
C24H32FN3O4
Mol. Mass.:
445.527
SMILES:
COc1ccc(F)cc1OCCNC(C)Cc1cc2CCN(CCCO)c2c(c1)C(N)=O
: