Target
Rhodopsin kinase GRK1
Ligand
BDBM50173306
Substrate
Meas. Tech.
ChEBML_1581284
IC50
>100000±n/a nM
Citation
 Waldschmidt, HVHoman, KTCruz-Rodríguez, OCato, MCWaninger-Saroni, JLarimore, KMCannavo, ASong, JCheung, JYKirchhoff, PDKoch, WJTesmer, JJLarsen, SD Structure-Based Design, Synthesis, and Biological Evaluation of Highly Selective and Potent G Protein-Coupled Receptor Kinase 2 Inhibitors. J Med Chem 59:3793-807 (2016)  
Target
Name:
Rhodopsin kinase GRK1
Synonyms:
G protein-coupled receptor kinase 1 GRK1_HUMAN RHOK | Rhodopsin kinase
Type:
PROTEIN
Mol. Mass.:
63520.09
Organism:
Homo sapiens (Human)
Description:
ChEMBL_774378
Residue:
563
  
Inhibitor
Name:
BDBM50173306
Synonyms:
CHEMBL3808565 | US10023564, Example 7
Type:
Small organic molecule
Emp. Form.:
C27H24FN7O3
Mol. Mass.:
513.523
SMILES:
CC1=C(C(NC(=O)N1)c1ccc(F)c(c1)C(=O)NCCc1ccncc1)C(=O)Nc1ccc2[nH]ncc2c1
: