Target
Rhodopsin kinase GRK1
Ligand
BDBM50173312
Substrate
Meas. Tech.
ChEMBL_1581284 (CHEMBL3811361)
IC50
>100000±n/a nM
Citation
 Waldschmidt, HVHoman, KTCruz-Rodríguez, OCato, MCWaninger-Saroni, JLarimore, KMCannavo, ASong, JCheung, JYKirchhoff, PDKoch, WJTesmer, JJLarsen, SD Structure-Based Design, Synthesis, and Biological Evaluation of Highly Selective and Potent G Protein-Coupled Receptor Kinase 2 Inhibitors. J Med Chem 59:3793-807 (2016)  
Target
Name:
Rhodopsin kinase GRK1
Synonyms:
G protein-coupled receptor kinase 1 GRK1_HUMAN RHOK | Rhodopsin kinase
Type:
PROTEIN
Mol. Mass.:
63520.09
Organism:
Homo sapiens (Human)
Description:
ChEMBL_774378
Residue:
563
  
Inhibitor
Name:
BDBM50173312
Synonyms:
CHEMBL3810312 | US10023564, Example 18
Type:
Small organic molecule
Emp. Form.:
C28H25FN6O4
Mol. Mass.:
528.5343
SMILES:
COc1cccc(CNC(=O)c2cc(ccc2F)C2NC(=O)NC(C)=C2C(=O)Nc2ccc3[nH]ncc3c2)c1
: