Target
Rhodopsin kinase GRK1
Ligand
BDBM50173318
Substrate
Meas. Tech.
ChEMBL_1581284 (CHEMBL3811361)
IC50
>100000±n/a nM
Citation
 Waldschmidt, HVHoman, KTCruz-Rodríguez, OCato, MCWaninger-Saroni, JLarimore, KMCannavo, ASong, JCheung, JYKirchhoff, PDKoch, WJTesmer, JJLarsen, SD Structure-Based Design, Synthesis, and Biological Evaluation of Highly Selective and Potent G Protein-Coupled Receptor Kinase 2 Inhibitors. J Med Chem 59:3793-807 (2016)  
Target
Name:
Rhodopsin kinase GRK1
Synonyms:
G protein-coupled receptor kinase 1 GRK1_HUMAN RHOK | Rhodopsin kinase
Type:
PROTEIN
Mol. Mass.:
63520.09
Organism:
Homo sapiens (Human)
Description:
ChEMBL_774378
Residue:
563
  
Inhibitor
Name:
BDBM50173318
Synonyms:
CHEMBL3809788 | US10023564, Example 17
Type:
Small organic molecule
Emp. Form.:
C29H21F7N6O3
Mol. Mass.:
634.5043
SMILES:
CC1=C(C(NC(=O)N1)c1ccc(F)c(c1)C(=O)NCc1c(cccc1C(F)(F)F)C(F)(F)F)C(=O)Nc1ccc2[nH]ncc2c1
: