Target
Rho-associated protein kinase 1
Ligand
BDBM50173316
Substrate
Meas. Tech.
ChEMBL_1581288 (CHEMBL3811365)
IC50
190±n/a nM
Citation
 Waldschmidt, HVHoman, KTCruz-Rodríguez, OCato, MCWaninger-Saroni, JLarimore, KMCannavo, ASong, JCheung, JYKirchhoff, PDKoch, WJTesmer, JJLarsen, SD Structure-Based Design, Synthesis, and Biological Evaluation of Highly Selective and Potent G Protein-Coupled Receptor Kinase 2 Inhibitors. J Med Chem 59:3793-807 (2016)  
Target
Name:
Rho-associated protein kinase 1
Synonyms:
ROCK-I ROCK1_HUMAN Rho-associated protein kinase Rho-associated, coiled-coil-containing protein kinase 1 Rho-kinase (ROCK I) p160 ROCK-1 | p160ROCK
Type:
Serine/threonine-protein kinase
Mol. Mass.:
158156.77
Organism:
Homo sapiens (Human)
Description:
Q13464
Residue:
1354
  
Inhibitor
Name:
BDBM50173316
Synonyms:
CHEMBL3810250
Type:
Small organic molecule
Emp. Form.:
C20H16FN5O4
Mol. Mass.:
409.3705
SMILES:
CC1=C(C(NC(=O)N1)c1ccc(F)c(c1)C(O)=O)C(=O)Nc1ccc2[nH]ncc2c1
: