Target
Dual specificity protein kinase TTK
Ligand
BDBM241228
Substrate
Meas. Tech.
ChEMBL_1581301 (CHEMBL3811378)
IC50
46±n/a nM
Citation
 Innocenti, PWoodward, HLSolanki, SNaud, SWestwood, IMCronin, NHayes, ARoberts, JHenley, ATBaker, RFaisal, AMak, GWBox, GValenti, MDe Haven Brandon, AO'Fee, LSaville, HSchmitt, JMatijssen, BBurke, Rvan Montfort, RLRaynaud, FIEccles, SALinardopoulos, SBlagg, JHoelder, S Rapid Discovery of Pyrido[3,4-d]pyrimidine Inhibitors of Monopolar Spindle Kinase 1 (MPS1) Using a Structure-Based Hybridization Approach. J Med Chem 59:3671-88 (2016)  
Target
Name:
Dual specificity protein kinase TTK
Synonyms:
Dual specificity protein kinase (TTK) MPS1 Monopolar Spindle 1 (MPS1) Monopolar Spindle 1 Kinase (MPS1) TTK | TTK_HUMAN
Type:
Protein
Mol. Mass.:
97086.79
Organism:
Homo sapiens (Human)
Description:
P33981
Residue:
857
  
Inhibitor
Name:
BDBM241228
Synonyms:
US10479788, Example 70 US9409907, 70
Type:
Small organic molecule
Emp. Form.:
C25H29N7O
Mol. Mass.:
443.5441
SMILES:
COc1cc(ccc1Nc1ncc2ccnc(NCC3CCCCC3)c2n1)-c1cnn(C)c1
: