Target
Tyrosyl-DNA phosphodiesterase 2
Ligand
BDBM50172654
Substrate
Meas. Tech.
ChEMBL_1579213 (CHEMBL3812293)
IC50
>111000±n/a nM
Citation
 Beck, DEReddy, PVLv, WAbdelmalak, MTender, GSLopez, SAgama, KMarchand, CPommier, YCushman, M Investigation of the Structure-Activity Relationships of Aza-A-Ring Indenoisoquinoline Topoisomerase I Poisons. J Med Chem 59:3840-53 (2016)  
Target
Name:
Tyrosyl-DNA phosphodiesterase 2
Synonyms:
EAP2 ETS1-associated protein 2 TDP2 TTRAP Tyr-DNA phosphodiesterase 2 Tyrosyl-DNA phosphodiesterase 2 (hTDP2) VPg unlinkase | hTDP2
Type:
Enzyme Catalytic Domain
Mol. Mass.:
40916.54
Organism:
Homo sapiens (Human)
Description:
gi_23510348
Residue:
362
  
Inhibitor
Name:
BDBM50172654
Synonyms:
CHEMBL3809052
Type:
Small organic molecule
Emp. Form.:
C21H16N4O2
Mol. Mass.:
356.3773
SMILES:
O=C1c2ccccc2-c2c1c1ncccc1c(=O)n2CCCn1ccnc1
: