Target
Bifunctional epoxide hydrolase 2
Ligand
BDBM50173528
Substrate
Meas. Tech.
ChEMBL_1580943 (CHEMBL3812611)
IC50
1730±n/a nM
Citation
 Manickam, MPillaiyar, TBoggu, PVenkateswararao, EJalani, HBKim, NDLee, SKJeon, JSKim, SKJung, SH Discovery of enantioselectivity of urea inhibitors of soluble epoxide hydrolase. Eur J Med Chem 117:113-24 (2016)  
Target
Name:
Bifunctional epoxide hydrolase 2
Synonyms:
Cytosolic epoxide hydrolase 2 EPHX2 HYES_HUMAN Soluble epoxide hydrolase (sEH) | epoxide hydrolase 2, cytoplasmic
Type:
Enzyme
Mol. Mass.:
62613.07
Organism:
Homo sapiens (Human)
Description:
P34913
Residue:
555
  
Inhibitor
Name:
BDBM50173528
Synonyms:
CHEMBL3809673
Type:
Small organic molecule
Emp. Form.:
C18H22N2O
Mol. Mass.:
282.3801
SMILES:
C[C@@H](NC(=O)NCCCc1ccccc1)c1ccccc1
: