Target
P2X purinoceptor 7
Ligand
BDBM173260
Substrate
Meas. Tech.
ChEMBL_1580955 (CHEMBL3812623)
Ki
58±n/a nM
Citation
 Abdel-Magid, AF Promising Therapeutic Potential of P2X7 Modulators. ACS Med Chem Lett 7:348-50 (2016)  
Target
Name:
P2X purinoceptor 7
Synonyms:
ATP receptor P2X purinoceptor 7 P2X purinoceptor 7 (P2X7) P2X7 rat P2rx7 | Purinergic receptor
Type:
Protein
Mol. Mass.:
68403.50
Organism:
Rattus norvegicus (Rat)
Description:
Q64663
Residue:
595
  
Inhibitor
Name:
BDBM173260
Synonyms:
US10323032, Example 12 US9604982, Example 12
Type:
Small organic molecule
Emp. Form.:
C20H14ClF3N4O
Mol. Mass.:
418.8
SMILES:
FC(F)(F)c1cccc(C(=O)N2CCc3c(C2)ncnc3-c2ccccn2)c1Cl
: