Target
DNA gyrase subunit B
Ligand
BDBM50173722
Substrate
Meas. Tech.
ChEMBL_1580968 (CHEMBL3812636)
IC50
10.0±n/a nM
Citation
 Cross, JBZhang, JYang, QMesleh, MFRomero, JAWang, BBevan, DPoutsiaka, KMEpie, FMoy, TDaniel, AShotwell, JChamberlain, BCarter, NAndersen, OBarker, JRyan, MDMetcalf, CASilverman, JNguyen, KLippa, BDolle, RE Discovery of Pyrazolopyridones as a Novel Class of Gyrase B Inhibitors Using Structure Guided Design. ACS Med Chem Lett 7:374-8 (2016)  
Target
Name:
DNA gyrase subunit B
Synonyms:
DNA gyrase DNA gyrase subunit B (gyrB) gyrB
Type:
Enzyme Subunit
Mol. Mass.:
72530.91
Organism:
Staphylococcus aureus
Description:
Residue:
644
  
Inhibitor
Name:
BDBM50173722
Synonyms:
CHEMBL3809648
Type:
Small organic molecule
Emp. Form.:
C23H27N7OS
Mol. Mass.:
449.572
SMILES:
CCCn1c2[nH]nc(-c3cnc(s3)-c3ccc(CN4CCN(C)CC4)nc3)c2ccc1=O
: