Target
Branched-chain-amino-acid aminotransferase, cytosolic
Ligand
BDBM50173939
Substrate
Meas. Tech.
ChEBML_1581369
IC50
1259±n/a nM
Citation
 Deng, HZhou, JSundersingh, FMesser, JASomers, DOAjakane, MArico-Muendel, CCBeljean, ABelyanskaya, SLBingham, RBlazensky, EBoullay, ABBoursier, EChai, JCarter, PChung, CWDaugan, ADing, YHerry, KHobbs, CHumphries, EKollmann, CNguyen, VLNicodeme, ESmith, SEDodic, NAncellin, N Discovery and Optimization of Potent, Selective, and in Vivo Efficacious 2-Aryl Benzimidazole BCATm Inhibitors. ACS Med Chem Lett 7:379-84 (2016)  
Target
Name:
Branched-chain-amino-acid aminotransferase, cytosolic
Synonyms:
BCAT1 BCT1 ECA39
Type:
PROTEIN
Mol. Mass.:
42957.10
Organism:
Homo sapiens (Human)
Description:
ChEMBL_1516919
Residue:
386
  
Inhibitor
Name:
BDBM50173939
Synonyms:
CHEMBL3809237
Type:
Small organic molecule
Emp. Form.:
C27H27BrN4O2S2
Mol. Mass.:
583.563
SMILES:
CNC(=O)c1ccc2n([C@@H]3CCC[C@@H](C3)NC(=O)c3ccc(Br)s3)c(nc2c1)-c1ccccc1SC
: