Target
Metallo-beta-lactamase type 2
Ligand
BDBM50174303
Substrate
Meas. Tech.
ChEBML_1578752
Ki
90±n/a nM
Citation
 Zhai, LZhang, YLKang, JSOelschlaeger, PXiao, LNie, SSYang, KW Triazolylthioacetamide: A Valid Scaffold for the Development of New Delhi Metallo-ß-Lactmase-1 (NDM-1) Inhibitors. ACS Med Chem Lett 7:413-7 (2016)  
Target
Name:
Metallo-beta-lactamase type 2
Synonyms:
BLAB_BACCE Metallo-beta-lactamase domain-containing protein 2 | Metallo-beta-lactamase superfamily protein
Type:
PROTEIN
Mol. Mass.:
28044.00
Organism:
Bacillus cereus
Description:
ChEMBL_104097
Residue:
256
  
Inhibitor
Name:
BDBM50174303
Synonyms:
CHEMBL3809419
Type:
Small organic molecule
Emp. Form.:
C8H8O2S
Mol. Mass.:
168.213
SMILES:
OC(=O)[C@H](S)c1ccccc1
: