Target
Carbonic anhydrase 9
Ligand
BDBM50174347
Substrate
Meas. Tech.
ChEMBL_1581000 (CHEMBL3812832)
Ki
49±n/a nM
Citation
 Kumar, SCeruso, MTuccinardi, TSupuran, CTSharma, PK Pyrazolylbenzo[d]imidazoles as new potent and selective inhibitors of carbonic anhydrase isoforms hCA IX and XII. Bioorg Med Chem 24:2907-2913 (2016)  
Target
Name:
Carbonic anhydrase 9
Synonyms:
CA-IX CAH9_HUMAN Carbonic anhydrase 9 (CA IX) Carbonic anhydrase 9 precursor Carbonic anhydrase IX (CAIX) Carbonic anhydrases; II & IX MN RCC-associated antigen G250
Type:
Enzyme
Mol. Mass.:
49669.03
Organism:
Homo sapiens (Human)
Description:
Catalytic domain of human cloned isozyme was used in the assay
Residue:
459
  
Inhibitor
Name:
BDBM50174347
Synonyms:
CHEMBL3613544
Type:
Small organic molecule
Emp. Form.:
C23H18N4O
Mol. Mass.:
366.4152
SMILES:
COc1ccc(cc1)-c1nn(cc1-c1nc2ccccc2[nH]1)-c1ccccc1
: