Target
Serine/threonine-protein kinase pim-1
Ligand
BDBM11318
Substrate
Meas. Tech.
ChEMBL_1581027 (CHEMBL3813032)
IC50
2500±n/a nM
Citation
 Schroeder, RLGoyal, NBratton, MTownley, IPham, NATram, PStone, TGeathers, JNguyen, KSridhar, J Identification of quinones as novel PIM1 kinase inhibitors. Bioorg Med Chem Lett 26:3187-91 (2016)  
Target
Name:
Serine/threonine-protein kinase pim-1
Synonyms:
PIM-1 Kinase PIM1_HUMAN Serine/threonine-protein kinase (PIM1) Serine/threonine-protein kinase PIM1 | Serine/threonine-protein kinase pim-1 (PIM1)
Type:
Protein
Mol. Mass.:
35681.82
Organism:
Homo sapiens (Human)
Description:
P11309
Residue:
313
  
Inhibitor
Name:
BDBM11318
Synonyms:
1,3,8-trihydroxy-6-methyl-9,10-dihydroanthracene-9,10-dione CHEMBL289277 US20230364057, Compound 242 | med.21724, Compound 24
Type:
Small organic molecule
Emp. Form.:
C15H10O5
Mol. Mass.:
270.2369
SMILES:
Cc1cc(O)c2C(=O)c3c(O)cc(O)cc3C(=O)c2c1
: