Target
Kappa-type opioid receptor
Ligand
BDBM50174570
Substrate
Meas. Tech.
ChEMBL_1579435 (CHEMBL3813455)
Ki
0.940000±n/a nM
Citation
 Guo, TGan, ZChen, JWang, DHe, LSong, QXu, Y Design, synthesis and biological evaluation of novel tetrahydroisoquinoline quaternary derivatives as peripheral¿-opioid receptor agonists. Bioorg Med Chem 24:2964-2970 (2016)  
Target
Name:
Kappa-type opioid receptor
Synonyms:
K-OR-1 Kappa-opioid receptor (KOR) Kappa-type opioid receptor (KOR) OPIATE Kappa OPRK1 kappa opioid receptor (KOR)
Type:
G Protein-Coupled Receptor (GPCR)
Mol. Mass.:
42648.76
Organism:
Homo sapiens (Human)
Description:
P41145
Residue:
380
  
Inhibitor
Name:
BDBM50174570
Synonyms:
CHEMBL3808824
Type:
Small organic molecule
Emp. Form.:
C28H34ClIN2O2
Mol. Mass.:
592.939
SMILES:
[I-].CCCC[N+]1(CC2N(CCc3ccccc23)C(=O)C2CC(=O)c3ccc(Cl)cc23)CCCC1
: