Target
Muscarinic acetylcholine receptor M4
Ligand
BDBM50174724
Substrate
Meas. Tech.
ChEMBL_1579485 (CHEMBL3810554)
EC50
1100±n/a nM
Citation
 Wood, MRNoetzel, MJEngers, JLBollinger, KAMelancon, BJTarr, JCHan, CWest, MGregro, ARLamsal, AChang, SAjmera, SSmith, EChase, PHodder, PSBubser, MJones, CKHopkins, CREmmitte, KANiswender, CMWood, MWDuggan, MEConn, PJBridges, TMLindsley, CW Discovery and optimization of a novel series of highly CNS penetrant M4 PAMs based on a 5,6-dimethyl-4-(piperidin-1-yl)thieno[2,3-d]pyrimidine core. Bioorg Med Chem Lett 26:3029-33 (2016)  
Target
Name:
Muscarinic acetylcholine receptor M4
Synonyms:
ACM4_HUMAN Cholinergic, muscarinic M4 Muscarinic acetylcholine receptor M2 and M4
Type:
Enzyme Catalytic Domain
Mol. Mass.:
53079.31
Organism:
Homo sapiens (Human)
Description:
Cholinergic, muscarinic M4 CHRM4 HUMAN M3::P08173
Residue:
479
  
Inhibitor
Name:
BDBM50174724
Synonyms:
CHEMBL3809603
Type:
Small organic molecule
Emp. Form.:
C18H24N4OS
Mol. Mass.:
344.474
SMILES:
Cc1sc2ncnc(N3CCC(CC3)C(=O)N3CCCC3)c2c1C
: