Target
ATP-sensitive inward rectifier potassium channel 1
Ligand
BDBM50175033
Substrate
Meas. Tech.
ChEBML_1580253
IC50
9.0±n/a nM
Citation
 Blass, B Inhibitors of Renal Outer Medullary Potassium Channel. ACS Med Chem Lett 7:447-8 (2016)  
Target
Name:
ATP-sensitive inward rectifier potassium channel 1
Synonyms:
ATP-regulated potassium channel ROM-K ATP-sensitive inward rectifier potassium channel 1 KCNJ1 Potassium channel (ATP modulatory) ROMK1 The Renal Outer Medullary Potassium (ROMK)
Type:
Enzyme Catalytic Domain
Mol. Mass.:
44809.08
Organism:
Homo sapiens (Human)
Description:
gi_223460826
Residue:
391
  
Inhibitor
Name:
BDBM50175033
Synonyms:
CHEMBL3808614
Type:
Small organic molecule
Emp. Form.:
C23H25ClN6O4
Mol. Mass.:
484.935
SMILES:
CC1=C(COC1=O)N1CCC2(CCN(C[C@@H](O)c3cc-4c(Cn5nnnc-45)cc3Cl)CC2)C1=O
: