Target
Sphingosine kinase 2
Ligand
BDBM50175278
Substrate
Meas. Tech.
ChEMBL_1580686 (CHEMBL3811132)
Ki
11000±n/a nM
Citation
 Houck, JDDawson, TKKennedy, AJKharel, YNaimon, NDField, SDLynch, KRMacdonald, TL Structural Requirements and Docking Analysis of Amidine-Based Sphingosine Kinase 1 Inhibitors Containing Oxadiazoles. ACS Med Chem Lett 7:487-92 (2016)  
Target
Name:
Sphingosine kinase 2
Synonyms:
SK 2 SPHK2 SPK 2 Sphingosine kinase types 2 (SphK2)
Type:
Protein
Mol. Mass.:
69221.44
Organism:
Homo sapiens (Human)
Description:
Q9NRA0
Residue:
654
  
Inhibitor
Name:
BDBM50175278
Synonyms:
CHEMBL3808979
Type:
Small organic molecule
Emp. Form.:
C25H39ClN4O
Mol. Mass.:
447.056
SMILES:
Cl.CCCCCCCCCCCCCc1ccc(cc1)-c1noc(n1)C1(CC1)C(N)=N
: