Target
Carbonic anhydrase 2
Ligand
BDBM50176361
Substrate
Meas. Tech.
ChEMBL_1579080 (CHEMBL3811428)
Ki
5.5±n/a nM
Citation
 Abdel Gawad, NMAmin, NHElsaadi, MTMohamed, FMMAngeli, ADe Luca, VCapasso, CSupuran, CT Synthesis of 4-(thiazol-2-ylamino)-benzenesulfonamides with carbonic anhydrase I, II and IX inhibitory activity and cytotoxic effects against breast cancer cell lines. Bioorg Med Chem 24:3043-3051 (2016)  
Target
Name:
Carbonic anhydrase 2
Synonyms:
CA-II CAC Carbonate dehydratase II Carbonic anhydrase 2 (CA-II) Carbonic anhydrase C Carbonic anhydrase II (CA-II) Carbonic anhydrase II (hCA II) | Carbonic anhydrase isoenzyme II (hCA II)
Type:
Enzyme
Mol. Mass.:
29250.71
Organism:
Homo sapiens (Human)
Description:
P00918
Residue:
260
  
Inhibitor
Name:
BDBM50176361
Synonyms:
CHEMBL3809698
Type:
Small organic molecule
Emp. Form.:
C15H14N6O5S3
Mol. Mass.:
454.504
SMILES:
NS(=O)(=O)c1ccc(N\N=C2/SC(Nc3ccc(cc3)S(N)(=O)=O)=NC2=O)cc1
: