Target
Polyunsaturated fatty acid 5-lipoxygenase
Ligand
BDBM50384998
Substrate
Meas. Tech.
ChEMBL_1582295 (CHEMBL3815922)
IC50
2100±n/a nM
Citation
 Forino, MPace, SChianese, GSantagostini, LWerner, MWeinigel, CRummler, SFico, GWerz, OTaglialatela-Scafati, O Humudifucol and Bioactive Prenylated Polyphenols from Hops (Humulus lupulus cv."Cascade"). J Nat Prod 79:590-7 (2016)  
Target
Name:
Polyunsaturated fatty acid 5-lipoxygenase
Synonyms:
5-LO 5-Lipoxygenase (5-LO) 5-Lipoygenase ALOX5 LOG5 | LOX5_HUMAN
Type:
Enzyme
Mol. Mass.:
77972.74
Organism:
Homo sapiens (Human)
Description:
Recombinant protein was purified from E. coli lysate. After ammonium sulfate precipitation and subsequent steps, the supernatant (S100) was used for 5-LO activity assay.
Residue:
674
  
Inhibitor
Name:
BDBM50384998
Synonyms:
CVD-0019905 | XANTHOHUMOL
Type:
Small organic molecule
Emp. Form.:
C21H22O5
Mol. Mass.:
354.3964
SMILES:
[#6]-[#8]-c1cc(-[#8])c(-[#6]\[#6]=[#6](/[#6])-[#6])c(-[#8])c1-[#6](=O)\[#6]=[#6]\c1ccc(-[#8])cc1
: