Target
[Pyruvate dehydrogenase (acetyl-transferring)] kinase isozyme 1, mitochondrial
Ligand
BDBM50177026
Substrate
Meas. Tech.
ChEMBL_1581971 (CHEMBL3816907)
Kd
291±n/a nM
Citation
 Zhang, SLHu, XZhang, WTam, KY Unexpected Discovery of Dichloroacetate Derived Adenosine Triphosphate Competitors Targeting Pyruvate Dehydrogenase Kinase To Inhibit Cancer Proliferation. J Med Chem 59:3562-8 (2016)  
Target
Name:
[Pyruvate dehydrogenase (acetyl-transferring)] kinase isozyme 1, mitochondrial
Synonyms:
PDHK1 PDK1_HUMAN Pyruvate dehydrogenase kinase 1 (PDK1) | Pyruvate dehydrogenase kinase isoform 1
Type:
Protein
Mol. Mass.:
49255.23
Organism:
Homo sapiens (Human)
Description:
Q15118
Residue:
436
  
Inhibitor
Name:
BDBM50177026
Synonyms:
CHEMBL3814630
Type:
Small organic molecule
Emp. Form.:
C9H5Cl3F3NO
Mol. Mass.:
306.496
SMILES:
FC(F)(F)c1cc(NC(=O)C(Cl)Cl)ccc1Cl
: