Target
Probable G-protein coupled receptor 34
Ligand
BDBM50177137
Substrate
Meas. Tech.
ChEMBL_1581710 (CHEMBL3816043)
EC50
>1000±n/a nM
Citation
 Jung, SInoue, ANakamura, SKishi, TUwamizu, ASayama, MIkubo, MOtani, YKano, KMakide, KAoki, JOhwada, T Conformational Constraint of the Glycerol Moiety of Lysophosphatidylserine Affords Compounds with Receptor Subtype Selectivity. J Med Chem 59:3750-76 (2016)  
Target
Name:
Probable G-protein coupled receptor 34
Synonyms:
G protein-coupled receptor 34 Gpr34 | Probable G-protein coupled receptor 34
Type:
PROTEIN
Mol. Mass.:
43201.40
Organism:
Mus musculus
Description:
ChEMBL_102842
Residue:
375
  
Inhibitor
Name:
BDBM50177137
Synonyms:
CHEMBL3814941
Type:
Small organic molecule
Emp. Form.:
C27H48NO9P
Mol. Mass.:
561.6451
SMILES:
CCCCCCCC\C=C/CCCCCCCC(=O)OCC1OCC=CC1OP(O)(=O)OCC(N)C(O)=O
: