Target
Mucosa-associated lymphoid tissue lymphoma translocation protein 1
Ligand
BDBM50177471
Substrate
Meas. Tech.
ChEMBL_1581726 (CHEMBL3816059)
IC50
2089±n/a nM
Citation
 Xin, BTSchimmack, GDu, YFlorea, BIvan der Marel, GADriessen, CKrappmann, DOverkleeft, HS Development of new Malt1 inhibitors and probes. Bioorg Med Chem 24:3312-29 (2016)  
Target
Name:
Mucosa-associated lymphoid tissue lymphoma translocation protein 1
Synonyms:
MALT lymphoma-associated translocation MALT1 MLT Paracaspase
Type:
Enzyme
Mol. Mass.:
92257.81
Organism:
Homo sapiens (Human)
Description:
Q9UDY8
Residue:
824
  
Inhibitor
Name:
BDBM50177471
Synonyms:
CHEMBL3813831
Type:
Small organic molecule
Emp. Form.:
C19H18BrClN4O3
Mol. Mass.:
465.728
SMILES:
COCCOc1nc(-c2ccc(Br)cc2)n(n1)-c1ccc(NC(=O)CCl)cc1
: