Target
Amyloid-beta precursor protein
Ligand
BDBM23926
Substrate
Meas. Tech.
ChEMBL_1582047 (CHEMBL3817085)
IC50
4100±n/a nM
Citation
 Mohamed, TShakeri, ATin, GRao, PP Structure-Activity Relationship Studies of Isomeric 2,4-Diaminoquinazolines onß-Amyloid Aggregation Kinetics. ACS Med Chem Lett 7:502-7 (2016)  
Target
Name:
Amyloid-beta precursor protein
Synonyms:
A4 ABPP AICD-50 AICD-59 AID(57) APP Alzheimer disease amyloid protein Amyloid beta Protein Amyloid beta protein Abeta(1-42) Amyloid intracellular domain 57 Amyloid protein (Abeta42b) Beta amyloid A4 protein Beta-APP42 Beta-amyloid protein 42 C83 CVAP Gamma Secretase Gamma-CTF(57) Gamma-secretase Gamma-secretase C-terminal fragment 57 P3(40) PN-II Protease nexin-II S-APP-beta Soluble APP-beta | beta-Amyloid Precursor Protein (APP)
Type:
Single-pass type I membrane protein
Mol. Mass.:
86890.41
Organism:
Homo sapiens (Human)
Description:
P05067
Residue:
770
  
Inhibitor
Name:
BDBM23926
Synonyms:
(E)-resveratrol CHEMBL165 Stilbene, 2f cid_445154 trans-resveratrol
Type:
Small organic molecule
Emp. Form.:
C14H12O3
Mol. Mass.:
228.2433
SMILES:
Oc1ccc(\C=C\c2cc(O)cc(O)c2)cc1
: