Target
Histone acetyltransferase p300
Ligand
BDBM50178219
Substrate
Meas. Tech.
ChEMBL_1582085 (CHEMBL3817162)
IC50
51±n/a nM
Citation
 Taylor, AMCôté, AHewitt, MCPastor, RLeblanc, YNasveschuk, CGRomero, FACrawford, TDCantone, NJayaram, HSetser, JMurray, JBeresini, MHde Leon Boenig, GChen, ZConery, ARCummings, RTDakin, LAFlynn, EMHuang, OWKaufman, SKeller, PJKiefer, JRLai, TLi, YLiao, JLiu, WLu, HPardo, ETsui, VWang, JWang, YXu, ZYan, FYu, DZawadzke, LZhu, XZhu, XSims, RJCochran, AGBellon, SAudia, JEMagnuson, SAlbrecht, BK Fragment-Based Discovery of a Selective and Cell-Active Benzodiazepinone CBP/EP300 Bromodomain Inhibitor (CPI-637). ACS Med Chem Lett 7:531-6 (2016)  
Target
Name:
Histone acetyltransferase p300
Synonyms:
EP300 HIF1A/p300/CREB-binding protein P300
Type:
Protein
Mol. Mass.:
264223.04
Organism:
Homo sapiens (Human)
Description:
Q09472
Residue:
2414
  
Inhibitor
Name:
BDBM50178219
Synonyms:
CHEMBL3814752
Type:
Small organic molecule
Emp. Form.:
C22H22N6O
Mol. Mass.:
386.4497
SMILES:
C[C@@H]1CC(=O)Nc2cccc(-c3ccc4n(C)nc(-c5cnn(C)c5)c4c3)c2N1
: