Target
Glutaminase kidney isoform, mitochondrial
Ligand
BDBM50178226
Substrate
Meas. Tech.
ChEMBL_1582438 (CHEMBL3816484)
IC50
120±n/a nM
Citation
 Zimmermann, SCWolf, EFLuu, AThomas, AGStathis, MPoore, BNguyen, CLe, ARojas, CSlusher, BSTsukamoto, T Allosteric Glutaminase Inhibitors Based on a 1,4-Di(5-amino-1,3,4-thiadiazol-2-yl)butane Scaffold. ACS Med Chem Lett 7:520-4 (2016)  
Target
Name:
Glutaminase kidney isoform, mitochondrial
Synonyms:
GLS GLSK_HUMAN K-glutaminase L-glutamine amidohydrolase
Type:
Protein
Mol. Mass.:
73471.89
Organism:
Homo sapiens (Human)
Description:
O94925
Residue:
669
  
Inhibitor
Name:
BDBM50178226
Synonyms:
CHEMBL3813967
Type:
Small organic molecule
Emp. Form.:
C24H24N6O4S2
Mol. Mass.:
524.615
SMILES:
Oc1ccc(CC(=O)Nc2nnc(CCCCc3nnc(NC(=O)Cc4ccc(O)cc4)s3)s2)cc1
: