Target
3-phosphoinositide-dependent protein kinase 1
Ligand
BDBM17053
Substrate
Meas. Tech.
ChEMBL_1583677 (CHEMBL3815764)
IC50
39±n/a nM
Citation
 Wucherer-Plietker, MMerkul, EMüller, TJEsdar, CKnöchel, THeinrich, TBuchstaller, HPGreiner, HDorsch, DFinsinger, DCalderini, MBruge, DGrädler, U Discovery of novel 7-azaindoles as PDK1 inhibitors. Bioorg Med Chem Lett 26:3073-80 (2016)  
Target
Name:
3-phosphoinositide-dependent protein kinase 1
Synonyms:
3-Phosphoinositide-Dependent Protein Kinase 1 (PDK1) 3-phosphoinositide-dependent protein kinase 1 3-phosphoinositide-dependent protein kinase 1 (PDK-1) Isoform 2 of 3-phosphoinositide-dependent protein kinase 1 PDPK1 Phosphoinositide-dependent protein kinase 1 (PDK1) hPDK1
Type:
Enzyme
Mol. Mass.:
63157.65
Organism:
Homo sapiens (Human)
Description:
O15530
Residue:
556
  
Inhibitor
Name:
BDBM17053
Synonyms:
BX-320 N-{3-[(5-bromo-2-{[3-(pyrrolidin-1-ylcarbonylamino)phenyl]amino}pyrimidin-4-yl)amino]propyl}-2,2-dimethylpropanediamide
Type:
Small organic molecule
Emp. Form.:
C23H31BrN8O3
Mol. Mass.:
547.448
SMILES:
CC(C)(C(N)=O)C(=O)NCCCNc1nc(Nc2cccc(NC(=O)N3CCCC3)c2)ncc1Br
: