Target
C-C chemokine receptor type 9
Ligand
BDBM50178716
Substrate
Meas. Tech.
ChEMBL_1583874 (CHEMBL3815306)
IC50
29±n/a nM
Citation
 Pandya, BABaber, CChan, AChamberlain, BChandonnet, HGoss, JHopper, TLippa, BPoutsiaka, KRomero, JStucka, SVaroglu, MZhang, JZhang, X Discovery of indole inhibitors of chemokine receptor 9 (CCR9). Bioorg Med Chem Lett 26:3322-3325 (2016)  
Target
Name:
C-C chemokine receptor type 9
Synonyms:
CCR9 GPR28
Type:
PROTEIN
Mol. Mass.:
42023.90
Organism:
Homo sapiens (Human)
Description:
ChEMBL_1510356
Residue:
369
  
Inhibitor
Name:
BDBM50178716
Synonyms:
CHEMBL3814511
Type:
Small organic molecule
Emp. Form.:
C19H19ClN2O2
Mol. Mass.:
342.819
SMILES:
CC(C)(C)c1ccc(Cn2c(cc3ccc(Cl)cc23)C(O)=O)cn1
: