Target
5-hydroxytryptamine receptor 2A
Ligand
BDBM50178969
Substrate
Meas. Tech.
ChEMBL_1582550 (CHEMBL3816812)
Ki
125±n/a nM
Citation
 Kapadia, NAhmed, SHarding, WW New halogenated tris-(phenylalkyl)amines as h5-HT2B receptor ligands. Bioorg Med Chem Lett 26:3216-3219 (2016)  
Target
Name:
5-hydroxytryptamine receptor 2A
Synonyms:
5-HT-2 5-HT2A 5-hydroxytryptamine receptor 2A (5HT-2A) 5HT2A_HUMAN HTR2A | Serotonin receptor 2A
Type:
undefined
Mol. Mass.:
52607.65
Organism:
Homo sapiens (Human)
Description:
P28223
Residue:
471
  
Inhibitor
Name:
BDBM50178969
Synonyms:
CHEMBL3814821
Type:
Small organic molecule
Emp. Form.:
C28H32ClNO4
Mol. Mass.:
482.011
SMILES:
COc1ccc(CCN(CCCc2cccc(Cl)c2)CCc2ccc3OCOc3c2)cc1OC
: