Target
5-hydroxytryptamine receptor 2B
Ligand
BDBM50178973
Substrate
Meas. Tech.
ChEMBL_1582551 (CHEMBL3816813)
Ki
14±n/a nM
Citation
 Kapadia, NAhmed, SHarding, WW New halogenated tris-(phenylalkyl)amines as h5-HT2B receptor ligands. Bioorg Med Chem Lett 26:3216-3219 (2016)  
Target
Name:
5-hydroxytryptamine receptor 2B
Synonyms:
5-HT-2B 5-hydroxytryptamine (serotonin) receptor 2B [Homo sapiens] 5-hydroxytryptamine receptor 2C (5HT2C) HTR2B Serotonin 2b (5-HT2b) receptor | Serotonin Receptor 2B
Type:
G Protein-Coupled Receptor (GPCR)
Mol. Mass.:
54312.47
Organism:
Homo sapiens (Human)
Description:
Receptor binding assays were performed using human clone stably expressed in CHO cells.
Residue:
481
  
Inhibitor
Name:
BDBM50178973
Synonyms:
CHEMBL3815066
Type:
Small organic molecule
Emp. Form.:
C28H32BrNO4
Mol. Mass.:
526.462
SMILES:
COc1ccc(CCN(CCCc2cccc(Br)c2)CCc2ccc3OCOc3c2)cc1OC
: