Target
5-hydroxytryptamine receptor 2C
Ligand
BDBM50178978
Substrate
Meas. Tech.
ChEMBL_1582552 (CHEMBL3816814)
Ki
79±n/a nM
Citation
 Kapadia, NAhmed, SHarding, WW New halogenated tris-(phenylalkyl)amines as h5-HT2B receptor ligands. Bioorg Med Chem Lett 26:3216-3219 (2016)  
Target
Name:
5-hydroxytryptamine receptor 2C
Synonyms:
5-HT-2C 5-HT2C-INI 5-HTR2C 5-hydroxytryptamine receptor 2C (5-HT-2C) 5HT-1C HTR1C Serotonin (5-HT3) receptor Serotonin Receptor 2C
Type:
G Protein-Coupled Receptor (GPCR)
Mol. Mass.:
51836.79
Organism:
Homo sapiens (Human)
Description:
P28335
Residue:
458
  
Inhibitor
Name:
BDBM50178978
Synonyms:
CHEMBL3815112
Type:
Small organic molecule
Emp. Form.:
C28H32FNO4
Mol. Mass.:
465.5564
SMILES:
COc1ccc(CCN(CCCc2ccccc2F)CCc2ccc3OCOc3c2)cc1OC
: