Target
Tyrosyl-DNA phosphodiesterase 2
Ligand
BDBM50179250
Substrate
Meas. Tech.
ChEMBL_1582564 (CHEMBL3816826)
IC50
5200±n/a nM
Citation
 Kossmann, BRAbdelmalak, MLopez, STender, GYan, CPommier, YMarchand, CIvanov, I Discovery of selective inhibitors of tyrosyl-DNA phosphodiesterase 2 by targeting the enzyme DNA-binding cleft. Bioorg Med Chem Lett 26:3232-3236 (2016)  
Target
Name:
Tyrosyl-DNA phosphodiesterase 2
Synonyms:
TRAF and TNF receptor-associated protein homolog Tyr-DNA phosphodiesterase 2 si:dkey-218n20.5 ttrap ttrapl
Type:
PROTEIN
Mol. Mass.:
41494.89
Organism:
Danio rerio
Description:
ChEMBL_116802
Residue:
369
  
Inhibitor
Name:
BDBM50179250
Synonyms:
CHEMBL3813826
Type:
Small organic molecule
Emp. Form.:
C23H19N5O6S
Mol. Mass.:
493.492
SMILES:
OC(=O)C1=NN(C(=O)\C1=C/c1ccc(cc1)N(CCC#N)CCC#N)c1ccc(cc1)S(O)(=O)=O
: