Target
Carbonic anhydrase 2
Ligand
BDBM50180246
Substrate
Meas. Tech.
ChEMBL_1583577 (CHEMBL3815664)
Ki
3.4±n/a nM
Citation
 Ulus, RAday, BTanç, MSupuran, CTKaya, M Microwave assisted synthesis of novel acridine-acetazolamide conjugates and investigation of their inhibition effects on human carbonic anhydrase isoforms hCA I, II, IV and VII. Bioorg Med Chem 24:3548-55 (2016)  
Target
Name:
Carbonic anhydrase 2
Synonyms:
CA-II CAC Carbonate dehydratase II Carbonic anhydrase 2 (CA-II) Carbonic anhydrase C Carbonic anhydrase II (CA-II) Carbonic anhydrase II (hCA II) | Carbonic anhydrase isoenzyme II (hCA II)
Type:
Enzyme
Mol. Mass.:
29250.71
Organism:
Homo sapiens (Human)
Description:
P00918
Residue:
260
  
Inhibitor
Name:
BDBM50180246
Synonyms:
CHEMBL3814309
Type:
Small organic molecule
Emp. Form.:
C33H32N6O5S2
Mol. Mass.:
656.774
SMILES:
CC1(C)CC(=O)C2=C(C1)N(C1=C(C2c2cccc(c2)C#N)C(=O)CC(C)(C)C1)c1ccc(cc1)C(=O)Nc1nnc(s1)S(N)(=O)=O
: