Target
Carbonic anhydrase 4
Ligand
BDBM50180245
Substrate
Meas. Tech.
ChEMBL_1583578 (CHEMBL3815665)
Ki
361±n/a nM
Citation
 Ulus, RAday, BTanç, MSupuran, CTKaya, M Microwave assisted synthesis of novel acridine-acetazolamide conjugates and investigation of their inhibition effects on human carbonic anhydrase isoforms hCA I, II, IV and VII. Bioorg Med Chem 24:3548-55 (2016)  
Target
Name:
Carbonic anhydrase 4
Synonyms:
CA-IV CAH4_HUMAN Carbonic anhydrase Carbonic anhydrase IV (CA IV)
Type:
Enzyme
Mol. Mass.:
35037.98
Organism:
Homo sapiens (Human)
Description:
P22748
Residue:
312
  
Inhibitor
Name:
BDBM50180245
Synonyms:
CHEMBL3814808
Type:
Small organic molecule
Emp. Form.:
C33H32N6O5S2
Mol. Mass.:
656.774
SMILES:
CC1(C)CC(=O)C2=C(C1)N(C1=C(C2c2ccc(cc2)C#N)C(=O)CC(C)(C)C1)c1ccc(cc1)C(=O)Nc1nnc(s1)S(N)(=O)=O
: