Target
Carbonic anhydrase 2
Ligand
BDBM50433842
Substrate
Meas. Tech.
ChEMBL_1583614 (CHEMBL3815701)
Ki
5.1±n/a nM
Citation
 Vullo, DSupuran, CTScozzafava, ADe Simone, GMonti, SMAlterio, VCarta, F Kinetic and X-ray crystallographic investigations of substituted 2-thio-6-oxo-1,6-dihydropyrimidine-benzenesulfonamides acting as carbonic anhydrase inhibitors. Bioorg Med Chem 24:3643-8 (2016)  
Target
Name:
Carbonic anhydrase 2
Synonyms:
CA-II CAC Carbonate dehydratase II Carbonic anhydrase 2 (CA-II) Carbonic anhydrase C Carbonic anhydrase II (CA-II) Carbonic anhydrase II (hCA II) | Carbonic anhydrase isoenzyme II (hCA II)
Type:
Enzyme
Mol. Mass.:
29250.71
Organism:
Homo sapiens (Human)
Description:
P00918
Residue:
260
  
Inhibitor
Name:
BDBM50433842
Synonyms:
CHEMBL2382402
Type:
Small organic molecule
Emp. Form.:
C20H15Cl2N5O4S2
Mol. Mass.:
524.4
SMILES:
CC(Sc1nc(-c2ccc(Cl)c(Cl)c2)c(C#N)c(=O)[nH]1)C(=O)Nc1ccc(cc1)S(N)(=O)=O
: