Target
Maltase-glucoamylase
Ligand
BDBM50180582
Substrate
Meas. Tech.
ChEMBL_1583833 (CHEMBL3815265)
IC50
690±n/a nM
Citation
 Tanabe, GXie, WBalakishan, GAmer, MFTsutsui, NTakemura, HNakamura, SAkaki, JNinomiya, KMorikawa, TNakanishi, IMuraoka, O Hydrophobic substituents increase the potency of salacinol, a potenta-glucosidase inhibitor from Ayurvedic traditional medicine 'Salacia'. Bioorg Med Chem 24:3705-15 (2016)  
Target
Name:
Maltase-glucoamylase
Synonyms:
Alpha glucosidase MGA MGAML Maltase | Maltase-glucoamylase, intestinal
Type:
Enzyme
Mol. Mass.:
209817.06
Organism:
Homo sapiens (Human)
Description:
O43451
Residue:
1857
  
Inhibitor
Name:
BDBM50180582
Synonyms:
CHEMBL3814988
Type:
Small organic molecule
Emp. Form.:
C13H27ClO6S
Mol. Mass.:
346.868
SMILES:
[Cl-].CC(C)CO[C@@H](CO)[C@H](O)C[S+]1C[C@@H](O)[C@H](O)[C@H]1CO
: