Target
Sucrase-isomaltase, intestinal
Ligand
BDBM50180580
Substrate
Meas. Tech.
ChEMBL_1583831 (CHEMBL3815263)
IC50
240±n/a nM
Citation
 Tanabe, GXie, WBalakishan, GAmer, MFTsutsui, NTakemura, HNakamura, SAkaki, JNinomiya, KMorikawa, TNakanishi, IMuraoka, O Hydrophobic substituents increase the potency of salacinol, a potenta-glucosidase inhibitor from Ayurvedic traditional medicine 'Salacia'. Bioorg Med Chem 24:3705-15 (2016)  
Target
Name:
Sucrase-isomaltase, intestinal
Synonyms:
SUIS_RAT Sucrase-isomaltase | alpha-Glucosidase (α-Glucosidase)
Type:
Enzyme
Mol. Mass.:
210329.04
Organism:
Rattus norvegicus (Rat)
Description:
P23739
Residue:
1841
  
Inhibitor
Name:
BDBM50180580
Synonyms:
CHEMBL3814911
Type:
Small organic molecule
Emp. Form.:
C16H33ClO6S
Mol. Mass.:
388.948
SMILES:
[Cl-].CCCCCCCO[C@@H](CO)[C@H](O)C[S+]1C[C@@H](O)[C@H](O)[C@H]1CO
: