Target
Potassium channel subfamily K member 2
Ligand
BDBM30705
Substrate
Meas. Tech.
ChEMBL_1584382 (CHEMBL3819803)
EC50
139400±n/a nM
Citation
 Vivier, DBennis, KLesage, FDucki, S Perspectives on the Two-Pore Domain Potassium Channel TREK-1 (TWIK-Related K(+) Channel 1). A Novel Therapeutic Target? J Med Chem 59:5149-57 (2016)  
Target
Name:
Potassium channel subfamily K member 2
Synonyms:
KCNK2 Outward rectifying potassium channel protein TREK-1 TREK-1 K(+) channel subunit Twik-RElated Potassium (K+) channel 1 (TREK1) Two pore potassium channel TPKC1
Type:
Protein
Mol. Mass.:
47099.16
Organism:
Homo sapiens (Human)
Description:
O95069
Residue:
426
  
Inhibitor
Name:
BDBM30705
Synonyms:
CHEMBL744 RILUZOLE cid_5070
Type:
Small organic molecule
Emp. Form.:
C8H5F3N2OS
Mol. Mass.:
234.198
SMILES:
Nc1nc2ccc(OC(F)(F)F)cc2s1
: