Target
Prolyl endopeptidase
Ligand
BDBM50155838
Substrate
Meas. Tech.
ChEMBL_1584420 (CHEMBL3819963)
Ki
0.920000±n/a nM
Citation
 Mariaule, GDe Cesco, SAiraghi, FKurian, JSchiavini, PRocheleau, SHuskic, IAuclair, KMittermaier, AMoitessier, N 3-Oxo-hexahydro-1H-isoindole-4-carboxylic Acid as a Drug Chiral Bicyclic Scaffold: Structure-Based Design and Preparation of Conformationally Constrained Covalent and Noncovalent Prolyl Oligopeptidase Inhibitors. J Med Chem 59:4221-34 (2016)  
Target
Name:
Prolyl endopeptidase
Synonyms:
PE POP PREP Prolyl oligopeptidase
Type:
Enzyme
Mol. Mass.:
80688.50
Organism:
Homo sapiens (Human)
Description:
P48147
Residue:
710
  
Inhibitor
Name:
BDBM50155838
Synonyms:
(S)-1-((S)-1-(4-phenylbutanoyl)pyrrolidine-2-carbonyl)pyrrolidine-2-carbonitrile CHEMBL189620
Type:
Small organic molecule
Emp. Form.:
C20H25N3O2
Mol. Mass.:
339.4314
SMILES:
O=C(CCCc1ccccc1)N1CCC[C@H]1C(=O)N1CCC[C@H]1C#N
: