Target
Carbonic anhydrase 2
Ligand
BDBM50415863
Substrate
Meas. Tech.
ChEMBL_1584561 (CHEMBL3820552)
Kd
98300±n/a nM
Citation
 Gaspari, RRechlin, CHeine, ABottegoni, GRocchia, WSchwarz, DBomke, JGerber, HDKlebe, GCavalli, A Kinetic and Structural Insights into the Mechanism of Binding of Sulfonamides to Human Carbonic Anhydrase by Computational and Experimental Studies. J Med Chem 59:4245-56 (2016)  
Target
Name:
Carbonic anhydrase 2
Synonyms:
CA-II CAC Carbonate dehydratase II Carbonic anhydrase 2 (CA-II) Carbonic anhydrase C Carbonic anhydrase II (CA-II) Carbonic anhydrase II (hCA II) | Carbonic anhydrase isoenzyme II (hCA II)
Type:
Enzyme
Mol. Mass.:
29250.71
Organism:
Homo sapiens (Human)
Description:
P00918
Residue:
260
  
Inhibitor
Name:
BDBM50415863
Synonyms:
CHEMBL358263
Type:
Small organic molecule
Emp. Form.:
C8H11NO2S
Mol. Mass.:
185.243
SMILES:
CCc1ccc(cc1)S(N)(=O)=O
: