Target
Tubulin beta chain
Ligand
BDBM50181051
Substrate
Meas. Tech.
ChEMBL_1584262 (CHEMBL3822006)
IC50
2680±n/a nM
Citation
 Yan, JChen, JZhang, SHu, JHuang, LLi, X Synthesis, Evaluation, and Mechanism Study of Novel Indole-Chalcone Derivatives Exerting Effective Antitumor Activity Through Microtubule Destabilization in Vitro and in Vivo. J Med Chem 59:5264-83 (2016)  
Target
Name:
Tubulin beta chain
Synonyms:
Beta-tubulin Tubulin beta chain
Type:
PROTEIN
Mol. Mass.:
49840.26
Organism:
Sus scrofa
Description:
ChEMBL_105107
Residue:
445
  
Inhibitor
Name:
BDBM50181051
Synonyms:
CHEMBL3818850
Type:
Small organic molecule
Emp. Form.:
C22H23NO5
Mol. Mass.:
381.4217
SMILES:
COc1ccc2c(\C=C(/C)C(=O)c3cc(OC)c(OC)c(OC)c3)c[nH]c2c1
: