Target
Neuraminidase
Ligand
BDBM4994
Substrate
Meas. Tech.
ChEMBL_1584616 (CHEMBL3820944)
IC50
1.000000±n/a nM
Citation
 Wang, PCFang, JMTsai, KCWang, SYHuang, WITseng, YCCheng, YSCheng, TJWong, CH Peramivir Phosphonate Derivatives as Influenza Neuraminidase Inhibitors. J Med Chem 59:5297-310 (2016)  
Target
Name:
Neuraminidase
Synonyms:
NA | NRAM_I33A0
Type:
PROTEIN
Mol. Mass.:
49687.56
Organism:
Influenza A virus
Description:
ChEMBL_1347422
Residue:
453
  
Inhibitor
Name:
BDBM4994
Synonyms:
(3R,4R,5S)-5-amino-4-acetamido-3-(pentan-3-yloxy)cyclohex-1-ene-1-carboxylic acid GS4071 | Oseltamivir carboxylate
Type:
Small organic molecule
Emp. Form.:
C14H24N2O4
Mol. Mass.:
284.3514
SMILES:
CCC(CC)O[C@@H]1C=C(C[C@H](N)[C@H]1NC(C)=O)C(O)=O
: