Target
Serine/threonine-protein kinase PAK 2
Ligand
BDBM50182404
Substrate
Meas. Tech.
ChEBML_1584629
Ki
940±n/a nM
Citation
 Rudolph, JMurray, LJNdubaku, COO'Brien, TBlackwood, EWang, WAliagas, IGazzard, LCrawford, JJDrobnick, JLee, WZhao, XHoeflich, KPFavor, DADong, PZhang, HHeise, CEOh, AOng, CCLa, HChakravarty, PChan, CJakubiak, DEpler, JRamaswamy, SVega, RCain, GDiaz, DZhong, Y Chemically Diverse Group I p21-Activated Kinase (PAK) Inhibitors Impart Acute Cardiovascular Toxicity with a Narrow Therapeutic Window. J Med Chem 59:5520-41 (2016)  
Target
Name:
Serine/threonine-protein kinase PAK 2
Synonyms:
PAK2 Serine/threonine-protein kinase PAK 1/PAK 2/PAK 3 Serine/threonine-protein kinase PAK 2 (PAK2) | p21-Activated kinase 2 (PAK2)
Type:
Enzyme
Mol. Mass.:
58037.40
Organism:
Homo sapiens (Human)
Description:
Q13177
Residue:
524
  
Inhibitor
Name:
BDBM50182404
Synonyms:
CHEMBL3819371
Type:
Small organic molecule
Emp. Form.:
C25H25ClN6O
Mol. Mass.:
460.959
SMILES:
Cc1cncc(n1)-c1ccc(c(Cl)c1)-c1cc2cncnc2n(C[C@H]2CC[C@H](N)CC2)c1=O
: