Target
Platelet-activating factor acetylhydrolase
Ligand
BDBM50182421
Substrate
Meas. Tech.
ChEMBL_1584540 (CHEMBL3820395)
IC50
2.4±n/a nM
Citation
 Woolford, AJPero, JEAravapalli, SBerdini, VCoyle, JEDay, PJDodson, AMGrondin, PHolding, FPLee, LYLi, PManas, ESMarino, JMartin, ACMcCleland, BWMcMenamin, RLMurray, CWNeipp, CEPage, LWPatel, VKPotvain, FRich, SRivero, RASmith, KSomers, DOTrottet, LVelagaleti, RWilliams, GXie, R Exploitation of a Novel Binding Pocket in Human Lipoprotein-Associated Phospholipase A2 (Lp-PLA2) Discovered through X-ray Fragment Screening. J Med Chem 59:5356-67 (2016)  
Target
Name:
Platelet-activating factor acetylhydrolase
Synonyms:
1-alkyl-2-acetylglycerophosphocholine esterase LDL-PLA(2) PAF 2-acylhydrolase PAFAH PLA2G7 | Platelet-activating factor acetylhydrolase
Type:
PROTEIN
Mol. Mass.:
50084.41
Organism:
Homo sapiens (Human)
Description:
ChEMBL_156212
Residue:
441
  
Inhibitor
Name:
BDBM50182421
Synonyms:
CHEMBL3817896
Type:
Small organic molecule
Emp. Form.:
C23H29N3O3S
Mol. Mass.:
427.56
SMILES:
COC(CO)Cc1csc(Nc2cc(c(C)cc2OCCN)-c2ccccc2C)n1
: