Target
Shikimate kinase
Ligand
BDBM50182482
Substrate
Meas. Tech.
ChEMBL_1586646 (CHEMBL3822136)
Ki
>800000±n/a nM
Citation
 Prado, VLence, EManeiro, MVázquez-Ucha, JCBeceiro, AThompson, PHawkins, ARGonzález-Bello, C Targeting the Motion of Shikimate Kinase: Development of Competitive Inhibitors that Stabilize an Inactive Open Conformation of the Enzyme. J Med Chem 59:5471-87 (2016)  
Target
Name:
Shikimate kinase
Synonyms:
AROK_HELPY aroK
Type:
PROTEIN
Mol. Mass.:
18412.75
Organism:
Helicobacter pylori (strain ATCC 700392 / 26695) (Campylobacterpylori)
Description:
ChEMBL_432674
Residue:
162
  
Inhibitor
Name:
BDBM50182482
Synonyms:
CHEMBL3817864
Type:
Small organic molecule
Emp. Form.:
C18H18NNaO4
Mol. Mass.:
335.3296
SMILES:
[Na+].N[C@H]1C=C(C[C@@H](OCc2ccc3ccccc3c2)[C@@H]1O)C([O-])=O
: