Target
Cholinesterase
Ligand
BDBM50182487
Substrate
Meas. Tech.
ChEMBL_1585948 (CHEMBL3822265)
IC50
39210±n/a nM
Citation
 Abdul Wahab, SMSivasothy, YLiew, SYLitaudon, MMohamad, JAwang, K Natural cholinesterase inhibitors from Myristica cinnamomea King. Bioorg Med Chem Lett 26:3785-92 (2016)  
Target
Name:
Cholinesterase
Synonyms:
BCHE CHLE_HORSE | Cholinesterase
Type:
Enzyme
Mol. Mass.:
65643.35
Organism:
Equus caballus (Horse)
Description:
P81908
Residue:
574
  
Inhibitor
Name:
BDBM50182487
Synonyms:
Malabaricone A
Type:
Small organic molecule
Emp. Form.:
C21H26O3
Mol. Mass.:
326.4293
SMILES:
Oc1cccc(O)c1C(=O)CCCCCCCCc1ccccc1
: