Target
5-hydroxytryptamine receptor 1A
Ligand
BDBM50182742
Substrate
Meas. Tech.
ChEMBL_1586508 (CHEMBL3821447)
Ki
8.1±n/a nM
Citation
 Ofori, EZhu, XYEtukala, JRPeprah, KJordan, KRAdkins, AABricker, BAKang, HJHuang, XPRoth, BLAblordeppey, SY Design and synthesis of dual 5-HT1A and 5-HT7 receptor ligands. Bioorg Med Chem 24:3464-71 (2016)  
Target
Name:
5-hydroxytryptamine receptor 1A
Synonyms:
5-HT-1A 5-hydroxytryptamine receptor 1A (5-HT-1A) ADRB2RL1 Dopamine D2 receptor and serotonin 1a receptor HTR1A | Serotonin receptor 1A
Type:
Mol. Mass.:
46122.49
Organism:
Homo sapiens (Human)
Description:
Residue:
422
  
Inhibitor
Name:
BDBM50182742
Synonyms:
CHEMBL3818047
Type:
Small organic molecule
Emp. Form.:
C19H20ClNO
Mol. Mass.:
313.821
SMILES:
Clc1ccc(cc1)C(=O)CCCN1CCc2ccccc2C1
: