Target
Tyrosine-protein phosphatase non-receptor type 2
Ligand
BDBM13604
Substrate
Meas. Tech.
ChEMBL_1586205 (CHEMBL3819920)
IC50
36±n/a nM
Citation
 Li, XWang, LShi, D The design strategy of selective PTP1B inhibitors over TCPTP. Bioorg Med Chem 24:3343-52 (2016)  
Target
Name:
Tyrosine-protein phosphatase non-receptor type 2
Synonyms:
PTN2_HUMAN PTPT T-cell protein-tyrosine phosphatase TCPTP Tyrosine-protein phosphatase non-receptor type 2 (TC-PTP)
Type:
Protein
Mol. Mass.:
48481.80
Organism:
Homo sapiens (Human)
Description:
P17706
Residue:
415
  
Inhibitor
Name:
BDBM13604
Synonyms:
6-{4-[2-(1H-1,2,3-benzotriazol-1-yl)-3-{4-[difluoro(phosphono)methyl]phenyl}-2-phenylpropyl]phenyl}-2-(1-methoxy-3-methylbutyl)quinoline-8-phosphonic acid CHEMBL266753
Type:
Small organic molecule
Emp. Form.:
C43H42F2N4O7P2
Mol. Mass.:
826.7605
SMILES:
COC(CC(C)C)c1ccc2cc(cc(c2n1)P(O)(O)=O)-c1ccc(CC(Cc2ccc(cc2)C(F)(F)P(O)(O)=O)(c2ccccc2)n2nnc3ccccc23)cc1
: