Target
Sodium-dependent serotonin transporter
Ligand
BDBM50183073
Substrate
Meas. Tech.
ChEMBL_1586247 (CHEMBL3820065)
Ki
25±n/a nM
Citation
 Etukala, JRZhu, XYEyunni, SVOnyameh, EKOfori, EBricker, BAKang, HJHuang, XPRoth, BLAblordeppey, SY Development of CNS multi-receptor ligands: Modification of known D2 pharmacophores. Bioorg Med Chem 24:3671-9 (2016)  
Target
Name:
Sodium-dependent serotonin transporter
Synonyms:
5-HT Transporter 5HTT SC6A4_HUMAN SLC6A4 Serotonin transporter (5HTT) Sodium-dependent serotonin transporter (SERT) | Solute carrier family 6 member 4
Type:
Multi-pass membrane protein
Mol. Mass.:
70322.51
Organism:
Homo sapiens (Human)
Description:
P31645
Residue:
630
  
Inhibitor
Name:
BDBM50183073
Synonyms:
CHEMBL3818805
Type:
Small organic molecule
Emp. Form.:
C24H27ClN4O
Mol. Mass.:
422.95
SMILES:
Clc1ccc2n(C3CCN(CCCCc4c[nH]c5ccccc45)CC3)c(=O)[nH]c2c1
: